BDBM49554 (6E)-3-methyl-6-[(2-quinolin-8-ylhydrazinyl)methylidene]cyclohexa-2,4-dien-1-one::(6E)-3-methyl-6-[(8-quinolinylhydrazo)methylidene]-1-cyclohexa-2,4-dienone::(6E)-3-methyl-6-[[N'-(8-quinolyl)hydrazino]methylene]cyclohexa-2,4-dien-1-one::2-hydroxy-4-methylbenzaldehyde 8-quinolinylhydrazone::MLS000576838::SMR000185313::cid_5930555
SMILES Cc1ccc(CN=Nc2cccc3cccnc23)c(O)c1
InChI Key InChIKey=RNTRWCVHGDYLFR-UHFFFAOYSA-N
Data  2 EC50
  Tab Delimited (TSV)   2D SDfile   Computed 3D by Vconf -m prep SDfile
Find this compound or compounds like it in BindingDB:
Activity Spreadsheet -- Enzyme Inhibition Constant Data from BindingDB
Found 2 hits for monomerid = 49554
TargetAlkaline phosphatase, tissue-nonspecific isozyme(Homo sapiens (Human))
Sanford-Burnham Center For Chemical Genomics
Curated by PubChem BioAssay
LigandPNGBDBM49554((6E)-3-methyl-6-[(2-quinolin-8-ylhydrazinyl)methyl...)
Affinity DataEC50:  1.00E+5nM. Assay description: Data Source: Sanford-Burnham Center for Chemical Genomics (SBCCG) Source Affiliation: Sanford-Burnham Medical Research Institute (SBMRI, San Diego, C...
In DepthDetails PCBioAssay
TargetTranscription factor p65(Homo sapiens (Human))
Srmlsc
Curated by PubChem BioAssay
LigandPNGBDBM49554((6E)-3-methyl-6-[(2-quinolin-8-ylhydrazinyl)methyl...)
Affinity DataEC50:  9.47E+3nM. Assay description: Southern Research Molecular Libraries Screening Center (SRMLSC) Southern Research Institute (Birmingham, Alabama) NIH Molecular Libraries Screening C...
In DepthDetails PCBioAssay