BDBM4964 (2R,3R,4S)-4-amino-3-acetamido-2-{[2-(4-hydroxyphenyl)ethyl](propyl)carbamoyl}-3,4-dihydro-2H-pyran-6-carboxylic acid::carboxamide deriv. 4ag
SMILES [H][C@]1(OC(=C[C@H](N)[C@H]1NC(C)=O)C(O)=O)C(=O)N(CCC)CCc1ccc(O)cc1
InChI Key InChIKey=XZYRYUBODJBXBL-CGTJXYLNSA-N
Data  2 IC50
  Tab Delimited (TSV)   2D SDfile   Computed 3D by Vconf -m prep SDfile
Find this compound or compounds like it in BindingDB:
Activity Spreadsheet -- Enzyme Inhibition Constant Data from BindingDB
Found 2 hits for monomerid = 4964
TargetNeuraminidase(Influenza B virus)
Glaxo Wellcome Research And Development
LigandPNGBDBM4964((2R,3R,4S)-4-amino-3-acetamido-2-{[2-(4-hydroxyphe...)
Affinity DataIC50:  1.90E+3nM. Assay description: A standard fluorimetric assay was used to measure influenza virus neuraminidase activity. The substrate 2 -(4-methylumbelliferyl)-alpha-D-acetylneura...
In DepthDetails ArticlePubMed
TargetNeuraminidase(Influenza A virus (A/Singapore/1/57(H2N2)))
Glaxo Wellcome Research And Development
LigandPNGBDBM4964((2R,3R,4S)-4-amino-3-acetamido-2-{[2-(4-hydroxyphe...)
Affinity DataIC50:  9nM. Assay description: A standard fluorimetric assay was used to measure influenza virus neuraminidase activity. The substrate 2 -(4-methylumbelliferyl)-alpha-D-acetylneura...
In DepthDetails ArticlePubMed