BDBM49852 MLS000707953::N-(5-chloranylpyridin-2-yl)-5-nitro-furan-2-carboxamide::N-(5-chloro-2-pyridinyl)-5-nitro-2-furancarboxamide::N-(5-chloro-2-pyridyl)-5-nitro-2-furamide::N-(5-chloropyridin-2-yl)-5-nitrofuran-2-carboxamide::SMR000289020::cid_952234
SMILES [O-][N+](=O)c1ccc(o1)C(=O)Nc1ccc(Cl)cn1
InChI Key InChIKey=ALSYYWANOOZBIV-UHFFFAOYSA-N
Data  1 IC50  2 EC50
  Tab Delimited (TSV)   2D SDfile   Computed 3D by Vconf -m prep SDfile
Find this compound or compounds like it in BindingDB:
Activity Spreadsheet -- Enzyme Inhibition Constant Data from BindingDB
Found 3 hits for monomerid = 49852
TargetTranscription factor p65(Homo sapiens (Human))
Srmlsc
Curated by PubChem BioAssay
LigandPNGBDBM49852(MLS000707953 | N-(5-chloranylpyridin-2-yl)-5-nitro...)
Affinity DataEC50:  2.31E+5nM. Assay description: Southern Research Molecular Libraries Screening Center (SRMLSC) Southern Research Institute (Birmingham, Alabama) NIH Molecular Libraries Screening C...
In DepthDetails PCBioAssay
TargetRecBCD enzyme subunit RecD(Escherichia coli str. K-12 substr. MG1655)
The Scripps Research Institute Molecular Screening Center
Curated by PubChem BioAssay
LigandPNGBDBM49852(MLS000707953 | N-(5-chloranylpyridin-2-yl)-5-nitro...)
Affinity DataIC50: >3.95E+4nM
In DepthDetails PCBioAssay
TargetHeat shock factor protein 1(Mus musculus)
Broad Institute
Curated by PubChem BioAssay
LigandPNGBDBM49852(MLS000707953 | N-(5-chloranylpyridin-2-yl)-5-nitro...)
Affinity DataEC50:  2.08E+4nM. Assay description: Keywords: Heat Shock Factor-1 (HSF-1), Stress Response, MG132, NIH3T3, Luminescence Assay Overview: Confirmation testing of small molecules identifie...
In DepthDetails PCBioAssay