BDBM50001996 5-Fluoro-1-(4-fluoro-phenyl)-3-(1-methyl-1,2,3,6-tetrahydro-pyridin-4-yl)-1H-indole::CHEMBL268974
SMILES CN1CCC(=CC1)c1cn(-c2ccc(F)cc2)c2ccc(F)cc12
InChI Key InChIKey=ZFOGIHQMXAYDAX-UHFFFAOYSA-N
Data  2 IC50
  Tab Delimited (TSV)   2D SDfile   Computed 3D by Vconf -m prep SDfile
Find this compound or compounds like it in BindingDB:
Activity Spreadsheet -- Enzyme Inhibition Constant Data from BindingDB
Found 2 hits for monomerid = 50001996
TargetSerotonin 2 (5-HT2) receptor(RAT)
H. Lundbeck
Curated by ChEMBL
LigandPNGBDBM50001996(5-Fluoro-1-(4-fluoro-phenyl)-3-(1-methyl-1,2,3,6-t...)
Affinity DataIC50:  3nM. Assay description: Inhibition of [3H]ketanserin binding to dopamine 5-hydroxytryptamine 2 receptor
In DepthDetails ArticlePubMed
TargetD(2) dopamine receptor(Rattus norvegicus (rat))
H. Lundbeck
Curated by ChEMBL
LigandPNGBDBM50001996(5-Fluoro-1-(4-fluoro-phenyl)-3-(1-methyl-1,2,3,6-t...)
Affinity DataIC50:  0.740nM. Assay description: Tested for the inhibition of [3H]-spiperone binding to dopamine D2 receptor
In DepthDetails ArticlePubMed