BDBM50002283 2-(1-Benzyl-piperidin-3-yl)-1-(4-fluoro-phenyl)-ethanone::CHEMBL136781
SMILES Fc1ccc(cc1)C(=O)CC1CCCN(Cc2ccccc2)C1
InChI Key InChIKey=DIQOZLFXPKMDDS-UHFFFAOYSA-N
Data  1 KI  1 IC50
  Tab Delimited (TSV)   2D SDfile   Computed 3D by Vconf -m prep SDfile
Find this compound or compounds like it in BindingDB:
Activity Spreadsheet -- Enzyme Inhibition Constant Data from BindingDB
Found 2 hits for monomerid = 50002283
TargetSigma non-opioid intracellular receptor 1(Mus musculus (Mouse))
Dupont Pharmaceuticals
Curated by ChEMBL
LigandPNGBDBM50002283(2-(1-Benzyl-piperidin-3-yl)-1-(4-fluoro-phenyl)-et...)
Affinity DataKi:  14nM. Assay description: In vitro binding affinity for the mouse sigma opioid receptor
In DepthDetails ArticlePubMed
TargetD(2) dopamine receptor(Mus musculus (Mouse))
Dupont Pharmaceuticals
Curated by ChEMBL
LigandPNGBDBM50002283(2-(1-Benzyl-piperidin-3-yl)-1-(4-fluoro-phenyl)-et...)
Affinity DataIC50:  34nM. Assay description: In vitro binding affinity towards dopamine receptor D2
In DepthDetails ArticlePubMed