BDBM50002449 CHEMBL2113166
SMILES COCCOc1cc2ncnc(NC3=CC(=O)C(Cl)=CC3=O)c2cc1OC
InChI Key InChIKey=JJWDGFHYXVCNTQ-UHFFFAOYSA-N
Data  4 IC50
PDB links: 24 PDB IDs match this monomer.
  Tab Delimited (TSV)   2D SDfile   Computed 3D by Vconf -m prep SDfile
Find this compound or compounds like it in BindingDB:
Activity Spreadsheet -- Enzyme Inhibition Constant Data from BindingDB
Found 4 hits for monomerid = 50002449
TargetVascular endothelial growth factor receptor 2(Homo sapiens (Human))
Wyeth Research
Curated by ChEMBL
LigandPNGBDBM50002449(CHEMBL2113166)
Affinity DataIC50:  569nM. Assay description: Inhibition of poly(Glu4-Tyr)peptide phosphorylation by recombinant VEGFR2 at 10 uM ATP and in presence of 5% mouse plasma
In DepthDetails ArticlePubMed
TargetVascular endothelial growth factor receptor 2(Homo sapiens (Human))
Wyeth Research
Curated by ChEMBL
LigandPNGBDBM50002449(CHEMBL2113166)
Affinity DataIC50: >1.00E+3nM. Assay description: Inhibition of poly(Glu4-Tyr)peptide phosphorylation by recombinant VEGFR2 at 10 uM ATP and in presence of 100 uM glutathione
In DepthDetails ArticlePubMed
TargetVascular endothelial growth factor receptor 2(Homo sapiens (Human))
Wyeth Research
Curated by ChEMBL
LigandPNGBDBM50002449(CHEMBL2113166)
Affinity DataIC50: >1.00E+3nM. Assay description: Inhibitory activity against VEGF stimulated autophosphorylation of VEGFR2 expressed in KDR15 cells
In DepthDetails ArticlePubMed
TargetVascular endothelial growth factor receptor 2(Homo sapiens (Human))
Wyeth Research
Curated by ChEMBL
LigandPNGBDBM50002449(CHEMBL2113166)
Affinity DataIC50:  4.40nM. Assay description: Inhibition of poly(Glu4-Tyr)peptide phosphorylation by recombinant VEGFR2 at 10 uM ATP
In DepthDetails ArticlePubMed