BDBM50006472 CHEMBL69183::[6-Oxo-1-(5-trifluoromethyl-benzothiazol-2-ylmethyl)-1,6-dihydro-pyridazin-3-yl]-acetic acid
SMILES OC(=O)Cc1ccc(=O)n(Cc2nc3cc(ccc3s2)C(F)(F)F)n1
InChI Key InChIKey=HJYHQUAVPCYWBM-UHFFFAOYSA-N
Data  1 IC50
  Tab Delimited (TSV)   2D SDfile   Computed 3D by Vconf -m prep SDfile
Find this compound or compounds like it in BindingDB:
Activity Spreadsheet -- Enzyme Inhibition Constant Data from BindingDB
Found 1 hit for monomerid = 50006472
TargetAldo-keto reductase family 1 member B1(Homo sapiens (Human))
Pfizer
Curated by ChEMBL
LigandPNGBDBM50006472(CHEMBL69183 | [6-Oxo-1-(5-trifluoromethyl-benzothi...)
Affinity DataIC50:  340nM. Assay description: Inhibitory activity against aldose reductase isolated from human placenta
In DepthDetails ArticlePubMed