BDBM50007886 2-Oxo-2,3-dihydro-benzoimidazole-1-carboxylic acid (8-methyl-8-aza-bicyclo[3.2.1]oct-3-yl)-amide::CHEMBL293468
SMILES CN1C2CCC1CC(C2)NC(=O)n1c2ccccc2[nH]c1=O
InChI Key InChIKey=RWXRJSRJIITQAK-UHFFFAOYSA-N
Data  1 KI
  Tab Delimited (TSV)   2D SDfile   Computed 3D by Vconf -m prep SDfile
Find this compound or compounds like it in BindingDB:
Activity Spreadsheet -- Enzyme Inhibition Constant Data from BindingDB
Found 1 hit for monomerid = 50007886
Target5-hydroxytryptamine receptor 3A/3B(Rattus norvegicus)
Istituto De Angeli
Curated by ChEMBL
LigandPNGBDBM50007886(2-Oxo-2,3-dihydro-benzoimidazole-1-carboxylic acid...)
Affinity DataKi:  3.80nM. Assay description: Concentration that inhibits the binding of radioligand, [3H]-ICS 205930, to 5-hydroxytryptamine 3 receptor from rat cortex
In DepthDetails ArticlePubMed