BDBM50007891 2-Oxo-2,3-dihydro-benzoimidazole-1-carboxylic acid (8-benzyl-8-aza-bicyclo[3.2.1]oct-3-yl)-amide::CHEMBL66972
SMILES O=C(NC1CC2CCC(C1)N2Cc1ccccc1)n1c2ccccc2[nH]c1=O
InChI Key InChIKey=LISZRGLNFQGDBY-UHFFFAOYSA-N
Data  1 KI
  Tab Delimited (TSV)   2D SDfile   Computed 3D by Vconf -m prep SDfile
Find this compound or compounds like it in BindingDB:
Activity Spreadsheet -- Enzyme Inhibition Constant Data from BindingDB
Found 1 hit for monomerid = 50007891
Target5-hydroxytryptamine receptor 3A/3B(Rattus norvegicus)
Istituto De Angeli
Curated by ChEMBL
LigandPNGBDBM50007891(2-Oxo-2,3-dihydro-benzoimidazole-1-carboxylic acid...)
Affinity DataKi: >1.00E+3nM. Assay description: Concentration that inhibits the binding of radioligand, [3H]-ICS 205930, to 5-hydroxytryptamine 3 receptor from rat cortex
In DepthDetails ArticlePubMed