BDBM50008435 (3-Benzo[b]thiophen-2-ylmethyl-4-oxo-3,4-dihydro-phthalazin-1-yl)-acetic acid::CHEMBL357460
SMILES OC(=O)Cc1nn(Cc2cc3cc(F)ccc3s2)c(=O)c2ccccc12
InChI Key InChIKey=OHAUPDIGXYKHKL-UHFFFAOYSA-N
Data  2 IC50
  Tab Delimited (TSV)   2D SDfile   Computed 3D by Vconf -m prep SDfile
Find this compound or compounds like it in BindingDB:
Activity Spreadsheet -- Enzyme Inhibition Constant Data from BindingDB
Found 2 hits for monomerid = 50008435
TargetAldo-keto reductase family 1 member B1(Homo sapiens (Human))
Jain University
Curated by ChEMBL
LigandPNGBDBM50008435((3-Benzo[b]thiophen-2-ylmethyl-4-oxo-3,4-dihydro-p...)
Affinity DataIC50:  150nM. Assay description: Inhibition of human placental aldose reductase using glyceraldehyde as substrate in presence of NADPH
In DepthDetails ArticlePubMed
TargetAldo-keto reductase family 1 member B1(Homo sapiens (Human))
Jain University
Curated by ChEMBL
LigandPNGBDBM50008435((3-Benzo[b]thiophen-2-ylmethyl-4-oxo-3,4-dihydro-p...)
Affinity DataIC50:  150nM. Assay description: In vitro inhibitory activity against aldose reductase isolated from human placenta
In DepthDetails ArticlePubMed