BDBM50008977 (8-Benzyloxy-2-methyl-imidazo[1,2-a]pyridin-3-yl)-acetonitrie::(8-Benzyloxy-2-methyl-imidazo[1,2-a]pyridin-3-yl)-acetonitrile::2-(8-(benzyloxy)-2-methylimidazo[1,2-a]pyridin-3-yl)acetonitrile::CHEMBL47529
SMILES Cc1nc2c(OCc3ccccc3)cccn2c1CC#N
InChI Key InChIKey=PYKJFEPAUKAXNN-UHFFFAOYSA-N
Data  9 IC50
PDB links: 1 PDB ID matches this monomer.
  Tab Delimited (TSV)   2D SDfile   Computed 3D by Vconf -m prep SDfile
Find this compound or compounds like it in BindingDB:
Activity Spreadsheet -- Enzyme Inhibition Constant Data from BindingDB
Found 9 hits for monomerid = 50008977
TargetPotassium-transporting ATPase alpha chain 1(Sus scrofa (Pig))
Smith Kline & French Research
Curated by ChEMBL
LigandPNGBDBM50008977((8-Benzyloxy-2-methyl-imidazo[1,2-a]pyridin-3-yl)-...)
Affinity DataIC50:  101nM. Assay description: In vitro inhibition of H+/K+ ATPase activity was determined in gastric vesicles of pig using ATPase assay with pH 7
TargetPotassium-transporting ATPase alpha chain 1/subunit beta(Homo sapiens (Human))
Schering-Plough Research Institute
Curated by ChEMBL
LigandPNGBDBM50008977((8-Benzyloxy-2-methyl-imidazo[1,2-a]pyridin-3-yl)-...)
Affinity DataIC50:  1.59E+3nMpH: 7.4Assay Description:Inhibition of purified H+/K+ ATPase at pH 7.4 as released inorganic phosphate from ATP using hog stomach gastric membrane vesicles
TargetPotassium-transporting ATPase alpha chain 1/subunit beta(Homo sapiens (Human))
Schering-Plough Research Institute
Curated by ChEMBL
LigandPNGBDBM50008977((8-Benzyloxy-2-methyl-imidazo[1,2-a]pyridin-3-yl)-...)
Affinity DataIC50:  65nM. Assay description: Inhibition of H+/K+ ATPase as reduced acid formation in rabbit gastric glands
TargetCytochrome P450 3A4(Homo sapiens (Human))
Glaxosmithkline
Curated by ChEMBL
LigandPNGBDBM50008977((8-Benzyloxy-2-methyl-imidazo[1,2-a]pyridin-3-yl)-...)
Affinity DataIC50:  1.20E+4nM. Assay description: Inhibition of CYP3A4 using 7-benzyloxyquinoline substrate
In DepthDetails ArticlePubMed
TargetCytochrome P450 1A2(Homo sapiens (Human))
Glaxosmithkline
Curated by ChEMBL
LigandPNGBDBM50008977((8-Benzyloxy-2-methyl-imidazo[1,2-a]pyridin-3-yl)-...)
Affinity DataIC50:  2.00E+3nM. Assay description: Inhibition of CYP1A2
In DepthDetails ArticlePubMed
TargetCytochrome P450 2D6(Homo sapiens (Human))
Glaxosmithkline
Curated by ChEMBL
LigandPNGBDBM50008977((8-Benzyloxy-2-methyl-imidazo[1,2-a]pyridin-3-yl)-...)
Affinity DataIC50:  8.20E+4nM. Assay description: Inhibition of CYP2D6
In DepthDetails ArticlePubMed
TargetCytochrome P450 2C19(Homo sapiens (Human))
Glaxosmithkline
Curated by ChEMBL
LigandPNGBDBM50008977((8-Benzyloxy-2-methyl-imidazo[1,2-a]pyridin-3-yl)-...)
Affinity DataIC50: >1.00E+5nM. Assay description: Inhibition of CYP2C19
In DepthDetails ArticlePubMed
TargetCytochrome P450 2C9(Homo sapiens (Human))
Glaxosmithkline
Curated by ChEMBL
LigandPNGBDBM50008977((8-Benzyloxy-2-methyl-imidazo[1,2-a]pyridin-3-yl)-...)
Affinity DataIC50:  5.40E+4nM. Assay description: Inhibition of CYP2C9
In DepthDetails ArticlePubMed
TargetCytochrome P450 3A4(Homo sapiens (Human))
Glaxosmithkline
Curated by ChEMBL
LigandPNGBDBM50008977((8-Benzyloxy-2-methyl-imidazo[1,2-a]pyridin-3-yl)-...)
Affinity DataIC50:  9.00E+3nM. Assay description: Inhibition of CYP3A4 using diethoxyfluorescein substrate
In DepthDetails ArticlePubMed