BDBM50010260 CHEMBL107566::[2-(2-Bromo-acetylamino)-ethyl]-carbamic acid 6,10,10b-trihydroxy-3,4a,7,7,10a-pentamethyl-1-oxo-3-vinyl-dodecahydro-benzo[f]chromen-5-yl ester
SMILES CC1(C)CC[C@H](O)[C@@]2(C)[C@H]1[C@H](O)[C@H](OC(=O)NCCNC(=O)CBr)[C@@]1(C)O[C@](C)(CC(=O)[C@]21O)C=C
InChI Key InChIKey=ZKNXIXAZHYISHJ-AOJWNCTJSA-N
Data  2 Kd
  Tab Delimited (TSV)   2D SDfile   Computed 3D by Vconf -m prep SDfile
Find this compound or compounds like it in BindingDB:
Activity Spreadsheet -- Enzyme Inhibition Constant Data from BindingDB
Found 2 hits for monomerid = 50010260
TargetSolute carrier family 2, facilitated glucose transporter member 1(Homo sapiens (Human))
Food And Drug Administration
Curated by ChEMBL
LigandPNGBDBM50010260(CHEMBL107566 | [2-(2-Bromo-acetylamino)-ethyl]-car...)
Affinity DataKd:  1.30E+3nM. Assay description: Binding activity against Glucose transporter in human erythrocyte membrane using [125I]-7-IHPP-Fsk as the radioligand.
In DepthDetails ArticlePubMed
TargetAdenylate cyclase type 1(Bos taurus)
Food And Drug Administration
Curated by ChEMBL
LigandPNGBDBM50010260(CHEMBL107566 | [2-(2-Bromo-acetylamino)-ethyl]-car...)
Affinity DataKd:  10nM. Assay description: Binding activity against Adenylate cyclase in bovine brain membrane using [125I]-6-IHPP-Fsk as the radioligand.
In DepthDetails ArticlePubMed