BDBM50010339 CHEMBL3263620
SMILES CCNC(=O)Nc1nc2cc(-c3ccn(CCN(C)C)c(=O)c3)c(OCC3CCOC3)nc2s1
InChI Key InChIKey=YPGJWNXHPOQFMA-UHFFFAOYSA-N
Data  1 IC50
  Tab Delimited (TSV)   2D SDfile   Computed 3D by Vconf -m prep SDfile
Find this compound or compounds like it in BindingDB:
Activity Spreadsheet -- Enzyme Inhibition Constant Data from BindingDB
Found 1 hit for monomerid = 50010339
TargetDNA gyrase subunit B(Mycobacterium smegmatis)
Astrazeneca India
Curated by ChEMBL
LigandPNGBDBM50010339(CHEMBL3263620)
Affinity DataIC50:  3nM. Assay description: Inhibition of Mycobacterium smegmatis DNA gyrase B ATPase activity assessed as inorganic phosphate release using ATP as substrate by colorimetric ana...
In DepthDetails ArticlePubMed