BDBM50010690 6-Methyl-5,6,6a,7,8,12b-hexahydro-benzo[a]phenanthridine-10,11-diol::CHEMBL51017
SMILES CN1Cc2ccccc2[C@H]2[C@H]1CCc1cc(O)c(O)cc21
InChI Key InChIKey=JFIXQOMKJZEWGH-CRAIPNDOSA-N
Data  2 IC50
  Tab Delimited (TSV)   2D SDfile   Computed 3D by Vconf -m prep SDfile
Find this compound or compounds like it in BindingDB:
Activity Spreadsheet -- Enzyme Inhibition Constant Data from BindingDB
Found 2 hits for monomerid = 50010690
TargetD(1A) dopamine receptor(RAT)
Purdue University
Curated by ChEMBL
LigandPNGBDBM50010690(6-Methyl-5,6,6a,7,8,12b-hexahydro-benzo[a]phenanth...)
Affinity DataIC50:  91nM. Assay description: Displacement of [3H]- #NAME? from binding Dopamine receptor D1 in rat striatum
In DepthDetails ArticlePubMed
TargetD(2) dopamine receptor(Rattus norvegicus (rat))
Purdue University
Curated by ChEMBL
LigandPNGBDBM50010690(6-Methyl-5,6,6a,7,8,12b-hexahydro-benzo[a]phenanth...)
Affinity DataIC50:  136nM. Assay description: Displacement of [3H]- -spiperone from Dopamine receptor D2 in rat striatum
In DepthDetails ArticlePubMed