BDBM50010987 CHEMBL3259880
SMILES CC(=O)N[C@H](Cc1ccccc1)C(=O)Nc1ccc(cc1)-c1nsc(=O)o1
InChI Key InChIKey=UTMWNVYSIIRNHA-MRXNPFEDSA-N
Data  1 KI  1 EC50
  Tab Delimited (TSV)   2D SDfile   Computed 3D by Vconf -m prep SDfile
Find this compound or compounds like it in BindingDB:
Activity Spreadsheet -- Enzyme Inhibition Constant Data from BindingDB
Found 2 hits for monomerid = 50010987
TargetProteasome subunit beta type-8(Homo sapiens (Human))
Weill Cornell Medical College
Curated by ChEMBL
LigandPNGBDBM50010987(CHEMBL3259880)
Affinity DataKi:  3.50E+3nM. Assay description: Inhibition of immunoproteasome-20S subunit beta5i in human PBMC assessed as substrate hydrolysis using suc-LLVY-AMC as substrate measured for 120 min...
In DepthDetails ArticlePubMed
TargetProteasome subunit beta type-7(Homo sapiens (Human))
Weill Cornell Medical College
Curated by ChEMBL
LigandPNGBDBM50010987(CHEMBL3259880)
Affinity DataEC50:  1.54E+4nM. Assay description: Inhibition of chymotrypsin-like activity of 26S proteasome in intact human Karpas 1106p cells assessed as substrate hydrolysis using Suc-LLVY-(D)-ami...
In DepthDetails ArticlePubMed