BDBM50012629 CHEMBL3261045
SMILES CO[C@H]1CCC2(Cc3ccc(cc3[C@@]22N=C(C)C(N)=N2)-c2cncc(c2)C#CC)CC1
InChI Key InChIKey=WKDNQONLGXOZRG-VOUYXJAQSA-N
Data  1 IC50
  Tab Delimited (TSV)   2D SDfile   Computed 3D by Vconf -m prep SDfile
Find this compound or compounds like it in BindingDB:
Activity Spreadsheet -- Enzyme Inhibition Constant Data from BindingDB
Found 1 hit for monomerid = 50012629
TargetBeta-secretase 1(Homo sapiens (Human))
Janssen Pharmaceutica
Curated by ChEMBL
LigandPNGBDBM50012629(CHEMBL3261045)
Affinity DataIC50:  0.200nM. Assay description: Inhibition of Fc domain of IgG1-fused human BACE (1 to 460) expressed in HEK293 cells preincubated for 10 mins followed by substrate addition measure...
In DepthDetails ArticlePubMed