BDBM50013045 3-[2-(2-Methyl-imidazol-1-ylmethyl)-thiazol-4-yl]-1H-indole::CHEMBL290266
SMILES Cc1nccn1Cc1nc(cs1)-c1c[nH]c2ccccc12
InChI Key InChIKey=FBOSKNMUTXENHA-UHFFFAOYSA-N
Data  2 KI
  Tab Delimited (TSV)   2D SDfile   Computed 3D by Vconf -m prep SDfile
Find this compound or compounds like it in BindingDB:
Activity Spreadsheet -- Enzyme Inhibition Constant Data from BindingDB
Found 2 hits for monomerid = 50013045
Target5-hydroxytryptamine receptor 3B(Mus musculus)
Pfizer
Curated by ChEMBL
LigandPNGBDBM50013045(3-[2-(2-Methyl-imidazol-1-ylmethyl)-thiazol-4-yl]-...)
Affinity DataKi: >1nM. Assay description: In vitro binding affinity for the 5-hydroxytryptamine 3 receptor was determined with NG-108-15 mouse neuroblastoma-glioma cells
In DepthDetails ArticlePubMed
Target5-hydroxytryptamine receptor 3A/3B(Rattus norvegicus)
Pfizer
Curated by ChEMBL
LigandPNGBDBM50013045(3-[2-(2-Methyl-imidazol-1-ylmethyl)-thiazol-4-yl]-...)
Affinity DataKi: >1.00E+3nM. Assay description: In vitro inhibition of rat liver dihydrofolate reductase.
In DepthDetails ArticlePubMed