BDBM50013237 3-Methyl-4-(4-methyl-2,3-dihydro-pyrrolo[3,2-c]quinolin-1-yl)-phenol::CHEMBL358421
SMILES Cc1cc(O)ccc1N1CCc2c1c1ccccc1nc2C
InChI Key InChIKey=HMBVZGJJMCCWHH-UHFFFAOYSA-N
Data  1 IC50
  Tab Delimited (TSV)   2D SDfile   Computed 3D by Vconf -m prep SDfile
Find this compound or compounds like it in BindingDB:
Activity Spreadsheet -- Enzyme Inhibition Constant Data from BindingDB
Found 1 hit for monomerid = 50013237
TargetPotassium-transporting ATPase alpha chain 1(Sus scrofa (Pig))
Smith Kline & French Research
Curated by ChEMBL
LigandPNGBDBM50013237(3-Methyl-4-(4-methyl-2,3-dihydro-pyrrolo[3,2-c]qui...)
Affinity DataIC50:  170nM. Assay description: In vitro inhibition of H+/K+ ATPase activity was determined in gastric vesicles of pig using ATPase assay with pH 7
In DepthDetails ArticlePubMed