BDBM50014358 CHEMBL103192::Sodium; 9-(4-fluoro-phenyl)-3,5-dihydroxy-8-(1-methyl-1H-tetrazol-5-yl)-9-phenyl-nona-6,8-dienoate
SMILES Cn1nnnc1\C(\C=C\[C@@H](O)C[C@@H](O)CC([O-])=O)=C(/c1ccccc1)c1ccc(F)cc1
InChI Key InChIKey=DVWJMSNCSNYDDS-HPVXQPOBSA-M
Data  1 IC50
  Tab Delimited (TSV)   2D SDfile   Computed 3D by Vconf -m prep SDfile
Find this compound or compounds like it in BindingDB:
Activity Spreadsheet -- Enzyme Inhibition Constant Data from BindingDB
Found 1 hit for monomerid = 50014358
Target3-hydroxy-3-methylglutaryl-coenzyme A reductase(Rattus norvegicus (rat))
Bristol-Myers Squibb
Curated by ChEMBL
LigandPNGBDBM50014358(CHEMBL103192 | Sodium; 9-(4-fluoro-phenyl)-3,5-dih...)
Affinity DataIC50:  44nM. Assay description: In vitro inhibitory activity was measured against rat liver HMG-CoA reductase
In DepthDetails ArticlePubMed