BDBM50014364 CHEMBL318102::Sodium; 8-[bis-(4-fluoro-phenyl)-methylene]-3,5-dihydroxy-9-methyl-dec-6-enoate
SMILES [#6]-[#6](-[#6])\[#6](\[#6]=[#6]\[#6@@H](-[#8])-[#6]-[#6@@H](-[#8])-[#6]-[#6](-[#8-])=O)=[#6](\c1ccc(F)cc1)-c1ccc(F)cc1
InChI Key InChIKey=DYRNBJYPPUSCSO-LKWCPCFXSA-M
Data  1 IC50
  Tab Delimited (TSV)   2D SDfile   Computed 3D by Vconf -m prep SDfile
Find this compound or compounds like it in BindingDB:
Activity Spreadsheet -- Enzyme Inhibition Constant Data from BindingDB
Found 1 hit for monomerid = 50014364
Target3-hydroxy-3-methylglutaryl-coenzyme A reductase(Rattus norvegicus (rat))
Bristol-Myers Squibb
Curated by ChEMBL
LigandPNGBDBM50014364(CHEMBL318102 | Sodium; 8-[bis-(4-fluoro-phenyl)-me...)
Affinity DataIC50:  230nM. Assay description: In vitro inhibitory activity was measured against rat liver HMG-CoA reductase
In DepthDetails ArticlePubMed