BDBM50014905 CHEMBL3262043
SMILES CO[C@@H](C)Cn1cc(cn1)-c1c(C)nc2c(nccn12)N1CCOCC1
InChI Key InChIKey=DPAWKOUFAHFNNS-ZDUSSCGKSA-N
Data  1 IC50
PDB links: 1 PDB ID matches this monomer.
  Tab Delimited (TSV)   2D SDfile   Computed 3D by Vconf -m prep SDfile
Find this compound or compounds like it in BindingDB:
Activity Spreadsheet -- Enzyme Inhibition Constant Data from BindingDB
Found 1 hit for monomerid = 50014905
TargetcAMP and cAMP-inhibited cGMP 3',5'-cyclic phosphodiesterase 10A(Rattus norvegicus (rat))
Janssen Pharmaceutica
Curated by ChEMBL
LigandPNGBDBM50014905(CHEMBL3262043)
Affinity DataIC50:  60nM. Assay description: Inhibition of rat recombinant PDE10A expressed in baculovirus infected Sf9 cells using [3H]cAMP as substrate after 60 mins by TopCount scintillation ...