BDBM50017672 CHEMBL127592::N-(1,1-Dimethyl-2-phenyl-ethyl)-2-[{[(1,1-dimethyl-2-phenyl-ethyl)-methyl-carbamoyl]-methyl}-(2-hydroxy-ethyl)-amino]-N-methyl-acetamide::Oxethazaine::cid_4621
SMILES CN(C(=O)CN(CCO)CC(=O)N(C)C(C)(C)Cc1ccccc1)C(C)(C)Cc1ccccc1
InChI Key InChIKey=FTLDJPRFCGDUFH-UHFFFAOYSA-N
Data  3 IC50
  Tab Delimited (TSV)   2D SDfile   Computed 3D by Vconf -m prep SDfile
Find this compound or compounds like it in BindingDB:
Activity Spreadsheet -- Enzyme Inhibition Constant Data from BindingDB
Found 3 hits for monomerid = 50017672
TargetUbiquitin-conjugating enzyme E2 N(Homo sapiens (Human))
Burnham Center For Chemical Genomics
Curated by PubChem BioAssay
LigandPNGBDBM50017672(CHEMBL127592 | N-(1,1-Dimethyl-2-phenyl-ethyl)-2-[...)
Affinity DataIC50: >2.00E+4nM. Assay description: Data Source: Sanford-Burnham Center for Chemical Genomics (SBCCG) Source Affiliation: Sanford-Burnham Medical Research Institute (SBMRI, San Diego CA...
In DepthDetails PCBioAssay
TargetBile salt export pump(Homo sapiens (Human))
Astrazeneca
Curated by ChEMBL
LigandPNGBDBM50017672(CHEMBL127592 | N-(1,1-Dimethyl-2-phenyl-ethyl)-2-[...)
Affinity DataIC50: <1.00E+4nM. Assay description: Inhibition of human BSEP expressed in baculovirus transfected fall armyworm Sf21 cell membranes vesicles assessed as reduction in ATP-dependent [3H]-...
In DepthDetails ArticlePubMed
TargetSodium channel protein type 1/2/3 subunit alpha(Homo sapiens (Human))
TBA
Curated by ChEMBL
LigandPNGBDBM50017672(CHEMBL127592 | N-(1,1-Dimethyl-2-phenyl-ethyl)-2-[...)
Affinity DataIC50:  2.30E+3nM. Assay description: Inhibition of binding of Batrachotoxinin [3H]BTX-B to high affinity sites on voltage dependent sodium channels in a vesicular preparation from guinea...
In DepthDetails ArticlePubMed