BDBM50018971 CHEMBL3287443
SMILES Cl.NC(=N)Nc1ccc(cc1)-c1cc(no1)C(=O)Nc1ccccc1
InChI Key InChIKey=SFHMYEYAKPOLSG-UHFFFAOYSA-N
Data  1 IC50
  Tab Delimited (TSV)   2D SDfile   Computed 3D by Vconf -m prep SDfile
Find this compound or compounds like it in BindingDB:
Activity Spreadsheet -- Enzyme Inhibition Constant Data from BindingDB
Found 1 hit for monomerid = 50018971
TargetAcrosin(Homo sapiens (Human))
Second Military Medical University
Curated by ChEMBL
LigandPNGBDBM50018971(CHEMBL3287443)
Affinity DataIC50:  2.46E+4nM. Assay description: Inhibition of human acrosin using N-alpha-benzoyl-L-arginine p-nitroanilide as substrate after 3 hrs by spectrophotometry
In DepthDetails ArticlePubMed