BDBM50019042 3-(6-Amino-purin-9-yl)-5-hydroxymethyl-4-methylene-cyclopentane-1,2-diol::CHEMBL53931
SMILES Nc1ncnc2n(cnc12)C1C(O)C(O)C(CO)C1=C
InChI Key InChIKey=REGXGANNNMTWAW-UHFFFAOYSA-N
Data  1 IC50
  Tab Delimited (TSV)   2D SDfile   Computed 3D by Vconf -m prep SDfile
Find this compound or compounds like it in BindingDB:
Activity Spreadsheet -- Enzyme Inhibition Constant Data from BindingDB
Found 1 hit for monomerid = 50019042
TargetAdenosylhomocysteinase(Homo sapiens (Human))
Syntex Research
Curated by ChEMBL
LigandPNGBDBM50019042(3-(6-Amino-purin-9-yl)-5-hydroxymethyl-4-methylene...)
Affinity DataIC50:  80nM. Assay description: Inhibition of S-adenosyl-homocysteine (AdoHcy)hydrolase from rabbit erythrocytes
In DepthDetails ArticlePubMed