BDBM50019850 CHEMBL3286915
SMILES Cc1nc2ccccc2n1CCOC(=O)C1CCN(CC1)c1nc2ccccc2n1Cc1ccccc1
InChI Key InChIKey=NDUUAIBOHSYUQA-UHFFFAOYSA-N
Data  1 Kd
  Tab Delimited (TSV)   2D SDfile   Computed 3D by Vconf -m prep SDfile
Find this compound or compounds like it in BindingDB:
Activity Spreadsheet -- Enzyme Inhibition Constant Data from BindingDB
Found 1 hit for monomerid = 50019850
TargetRetinal rod rhodopsin-sensitive cGMP 3',5'-cyclic phosphodiesterase subunit delta(Homo sapiens (Human))
Max Planck Institute Of Molecular Physiology
Curated by ChEMBL
LigandPNGBDBM50019850(CHEMBL3286915)
Affinity DataKd:  6nM. Assay description: Binding affinity to His6-tagged PDE-delta (unknown origin) measured every 3 mins by fluorescence polarization assay
In DepthDetails ArticlePubMed