BDBM50020282 CHEMBL3288831
SMILES COC(=O)[C@@H](C)Nc1c(C(=O)NCc2ccc(F)cc2F)c(=O)n(O)c2ncccc12
InChI Key InChIKey=UUAXQOKZCIDQKY-SNVBAGLBSA-N
Data  2 IC50
  Tab Delimited (TSV)   2D SDfile   Computed 3D by Vconf -m prep SDfile
Find this compound or compounds like it in BindingDB:
Activity Spreadsheet -- Enzyme Inhibition Constant Data from BindingDB
Found 2 hits for monomerid = 50020282
TargetIntegrase(Human immunodeficiency virus 1)
National Institutes Of Health
Curated by ChEMBL
LigandPNGBDBM50020282(CHEMBL3288831)
Affinity DataIC50:  27nM. Assay description: Inhibition of strand transfer activity of HIV-1 integrase using [gamma-32P]-labeled DNA as substrate
In DepthDetails ArticlePubMed
TargetIntegrase(Human immunodeficiency virus 1)
National Institutes Of Health
Curated by ChEMBL
LigandPNGBDBM50020282(CHEMBL3288831)
Affinity DataIC50:  5.80E+3nM. Assay description: Inhibition of 3'-processing activity of HIV-1 integrase using [gamma-32P]-labeled DNA as substrate
In DepthDetails ArticlePubMed