BDBM50020402 1-Benzyl-3-[2-(1-carboxy-nonylamino)-propionyl]-2-oxo-imidazolidine-4-carboxylic acid::CHEMBL101469
SMILES CCCCCCCC[C@H](N[C@@H](C)C(=O)N1[C@@H](CN(Cc2ccccc2)C1=O)C(O)=O)C(O)=O
InChI Key InChIKey=CKNHXDLZEFXBNR-IHPCNDPISA-N
Data  1 IC50
  Tab Delimited (TSV)   2D SDfile   Computed 3D by Vconf -m prep SDfile
Find this compound or compounds like it in BindingDB:
Activity Spreadsheet -- Enzyme Inhibition Constant Data from BindingDB
Found 1 hit for monomerid = 50020402
TargetAngiotensin-converting enzyme(Homo sapiens (Human))
Tanabe Seiyaku
Curated by ChEMBL
LigandPNGBDBM50020402(1-Benzyl-3-[2-(1-carboxy-nonylamino)-propionyl]-2-...)
Affinity DataIC50:  1.5nM. Assay description: Inhibition of Angiotensin I converting enzyme from pig renal cortex, hippuryl-histidyl-leucine as substrate
In DepthDetails ArticlePubMed