BDBM50020695 CHEMBL3290843
SMILES CCOc1ccc2nc(C(=O)Nc3c(F)cc(cc3F)-c3cccc(F)c3)c(C)c(C(O)=O)c2c1
InChI Key InChIKey=WDGMZRXEWWIPJI-UHFFFAOYSA-N
Data  1 IC50
  Tab Delimited (TSV)   2D SDfile   Computed 3D by Vconf -m prep SDfile
Find this compound or compounds like it in BindingDB:
Activity Spreadsheet -- Enzyme Inhibition Constant Data from BindingDB
Found 1 hit for monomerid = 50020695
TargetDihydroorotate dehydrogenase (quinone), mitochondrial(Homo sapiens (Human))
Nirma University
Curated by ChEMBL
LigandPNGBDBM50020695(CHEMBL3290843)
Affinity DataIC50:  2.83E+3nM. Assay description: Inhibition of recombinant human DHODH activity after 20 mins by DCIP dye based colorimetric analysis in presence of 1 mM L-dihydroorotate and 1 mM Cq...
In DepthDetails ArticlePubMed