BDBM50021697 CHEMBL3298197
SMILES CCNC(=O)C1(Cc2ccccc2C1)Nc1nc(NCCc2ccc(Cl)c(Cl)c2)nc(n1)N1CC2CC1CN2C(=O)c1cccc(c1)C(F)(F)F
InChI Key InChIKey=NOTIBQBOROOYKJ-UHFFFAOYSA-N
Data  1 IC50
  Tab Delimited (TSV)   2D SDfile   Computed 3D by Vconf -m prep SDfile
Find this compound or compounds like it in BindingDB:
Activity Spreadsheet -- Enzyme Inhibition Constant Data from BindingDB
Found 1 hit for monomerid = 50021697
TargetIntegrin alpha-L(Homo sapiens (Human))
Glaxosmithkline
Curated by ChEMBL
LigandPNGBDBM50021697(CHEMBL3298197)
Affinity DataIC50:  23nM. Assay description: Antagonist activity at C-terminal 6xHis-tagged LFA-1 LBD (unknown origin) expressed in Escherichia coli assessed as inhibition of interaction with IC...
In DepthDetails ArticlePubMed