BDBM50026565 3-Ethyl-N-(1-ethyl-pyrrolidin-2-ylmethyl)-2,6-dimethoxy-benzamide::CHEMBL282925
SMILES CCN1CCC[C@H]1CNC(=O)c1c(OC)ccc(CC)c1OC
InChI Key InChIKey=GGEDSWLSSJZGKV-AWEZNQCLSA-N
Data  2 IC50
  Tab Delimited (TSV)   2D SDfile   Computed 3D by Vconf -m prep SDfile
Find this compound or compounds like it in BindingDB:
Activity Spreadsheet -- Enzyme Inhibition Constant Data from BindingDB
Found 2 hits for monomerid = 50026565
TargetD(2) dopamine receptor(Homo sapiens (Human))
University Of Mazandaran
Curated by ChEMBL
LigandPNGBDBM50026565(3-Ethyl-N-(1-ethyl-pyrrolidin-2-ylmethyl)-2,6-dime...)
Affinity DataIC50:  1.29nM. Assay description: Antagonist activity at dopamine D2 receptor
In DepthDetails ArticlePubMed
TargetD(2) dopamine receptor(Rattus norvegicus (rat))
TBA
Curated by ChEMBL
LigandPNGBDBM50026565(3-Ethyl-N-(1-ethyl-pyrrolidin-2-ylmethyl)-2,6-dime...)
Affinity DataIC50:  921nM. Assay description: In vitro binding affinity at Dopamine receptor D2 in rat by displacing [3H]- spiperone from rat striatal membrane
In DepthDetails ArticlePubMed