BDBM50027702 CHEMBL3344394
SMILES C(CCn1ccc2c(\C=C\c3ccccc3)cccc12)Cn1ccnc1
InChI Key InChIKey=GDKHKECTYMDENM-VAWYXSNFSA-N
Data  2 KI  2 IC50
  Tab Delimited (TSV)   2D SDfile   Computed 3D by Vconf -m prep SDfile
Find this compound or compounds like it in BindingDB:
Activity Spreadsheet -- Enzyme Inhibition Constant Data from BindingDB
Found 4 hits for monomerid = 50027702
Target1,25-dihydroxyvitamin D(3) 24-hydroxylase, mitochondrial(Homo sapiens (Human))
Cardiff University
Curated by ChEMBL
LigandPNGBDBM50027702(CHEMBL3344394)
Affinity DataKi:  14nM. Assay description: Inhibition of N-terminally MBP-fused human CYP24A1 by cell-free assay
In DepthDetails ArticlePubMed
Target25-hydroxyvitamin D-1 alpha hydroxylase, mitochondrial(Mus musculus)
Cardiff University
Curated by ChEMBL
LigandPNGBDBM50027702(CHEMBL3344394)
Affinity DataKi:  25nM. Assay description: Inhibition of mouse CYP27B1 by cell-free assay
In DepthDetails ArticlePubMed
Target1,25-dihydroxyvitamin D(3) 24-hydroxylase, mitochondrial(Homo sapiens (Human))
Cardiff University
Curated by ChEMBL
LigandPNGBDBM50027702(CHEMBL3344394)
Affinity DataIC50:  200nM. Assay description: Inhibition of N-terminally MBP-fused human CYP24A1 by cell-free assay
In DepthDetails ArticlePubMed
Target25-hydroxyvitamin D-1 alpha hydroxylase, mitochondrial(Mus musculus)
Cardiff University
Curated by ChEMBL
LigandPNGBDBM50027702(CHEMBL3344394)
Affinity DataIC50:  150nM. Assay description: Inhibition of mouse CYP27B1 by cell-free assay
In DepthDetails ArticlePubMed