BDBM50028364 CHEMBL3342260
SMILES COc1ccc(cc1OC)C(CCC(=O)N(C)O)P(O)(O)=O
InChI Key InChIKey=MTKVPWZBCNHJJD-UHFFFAOYSA-N
Data  2 IC50
  Tab Delimited (TSV)   2D SDfile   Computed 3D by Vconf -m prep SDfile
Find this compound or compounds like it in BindingDB:
Activity Spreadsheet -- Enzyme Inhibition Constant Data from BindingDB
Found 2 hits for monomerid = 50028364
Target1-deoxy-D-xylulose 5-phosphate reductoisomerase(Mycobacterium tuberculosis)
Heinrich Heine Universit£T
Curated by ChEMBL
LigandPNGBDBM50028364(CHEMBL3342260)
Affinity DataIC50:  2.90E+4nM. Assay description: Inhibition of Mycobacterium tuberculosis IspC using 1-deoxy-D-xylulose 5-phosphate as substrate by photometric analysis
In DepthDetails ArticlePubMed
Target1-deoxy-D-xylulose 5-phosphate reductoisomerase(Escherichia coli)
Heinrich Heine Universit£T
Curated by ChEMBL
LigandPNGBDBM50028364(CHEMBL3342260)
Affinity DataIC50:  320nM. Assay description: Inhibition of Escherichia coli M15 recombinant IspC using 1-deoxy-D-xylulose 5-phosphate as substrate by photometric analysis
In DepthDetails ArticlePubMed