BDBM50032009 1-[4-(4-Hydroxy-2-methyl-phenylamino)-8-methoxy-quinolin-3-yl]-butan-1-one::CHEMBL92979
SMILES CCCC(=O)c1cnc2c(OC)cccc2c1Nc1ccc(O)cc1C
InChI Key InChIKey=MPXLXGYFXOQLDG-UHFFFAOYSA-N
Data  1 IC50
  Tab Delimited (TSV)   2D SDfile   Computed 3D by Vconf -m prep SDfile
Find this compound or compounds like it in BindingDB:
Activity Spreadsheet -- Enzyme Inhibition Constant Data from BindingDB
Found 1 hit for monomerid = 50032009
TargetPotassium-transporting ATPase alpha chain 1/subunit beta(Sus scrofa (Pig))
Smithkline Beecham Pharmaceuticals R&D
Curated by ChEMBL
LigandPNGBDBM50032009(1-[4-(4-Hydroxy-2-methyl-phenylamino)-8-methoxy-qu...)
Affinity DataIC50:  210nMpH: 7.0Assay Description:Inhibition of K+ -stimulated gastric ATPase activity was measured using lyophilized gastric vesicles at pH 7
In DepthDetails ArticlePubMed