BDBM50032052 1-[8-Hydroxymethyl-4-(4-hydroxy-2-methyl-phenylamino)-quinolin-3-yl]-propan-1-one::CHEMBL92666
SMILES CCC(=O)c1cnc2c(CO)cccc2c1Nc1ccc(O)cc1C
InChI Key InChIKey=TWQRIYJFYRLOJM-UHFFFAOYSA-N
Data  1 IC50
  Tab Delimited (TSV)   2D SDfile   Computed 3D by Vconf -m prep SDfile
Find this compound or compounds like it in BindingDB:
Activity Spreadsheet -- Enzyme Inhibition Constant Data from BindingDB
Found 1 hit for monomerid = 50032052
TargetPotassium-transporting ATPase alpha chain 1/subunit beta(Sus scrofa (Pig))
Smithkline Beecham Pharmaceuticals R&D
Curated by ChEMBL
LigandPNGBDBM50032052(1-[8-Hydroxymethyl-4-(4-hydroxy-2-methyl-phenylami...)
Affinity DataIC50:  180nMpH: 7.0Assay Description:Inhibition of K+ -stimulated gastric ATPase activity was measured using lyophilized gastric vesicles at pH 7
In DepthDetails ArticlePubMed