BDBM50032145 CHEMBL91804::N*2*-(4-Fluoro-2-methyl-phenyl)-N*4*-methyl-8-(3-morpholin-4-yl-propoxy)-N*4*-phenyl-quinazoline-2,4-diamine
SMILES CN(c1ccccc1)c1nc(Nc2ccc(F)cc2C)nc2c(OCCCN3CCOCC3)cccc12
InChI Key InChIKey=GBZQSQRLFZGYMR-UHFFFAOYSA-N
Data  1 IC50
  Tab Delimited (TSV)   2D SDfile   Computed 3D by Vconf -m prep SDfile
Find this compound or compounds like it in BindingDB:
Activity Spreadsheet -- Enzyme Inhibition Constant Data from BindingDB
Found 1 hit for monomerid = 50032145
TargetPotassium-transporting ATPase alpha chain 1/subunit beta(Sus scrofa (Pig))
Smithkline Beecham Pharmaceuticals R&D
Curated by ChEMBL
LigandPNGBDBM50032145(CHEMBL91804 | N*2*-(4-Fluoro-2-methyl-phenyl)-N*4*...)
Affinity DataIC50:  50nM. Assay description: Inhibition of K+ stimulated gastric ATPase activity
In DepthDetails ArticlePubMed