BDBM50032448 CHEMBL3354153
SMILES C[C@@H]1OC(=O)[C@@H]1NC(=O)OCc1cc2cc(C)ccc2s1
InChI Key InChIKey=MOOHXSKBWZMWLQ-TVQRCGJNSA-N
Data  2 IC50
  Tab Delimited (TSV)   2D SDfile   Computed 3D by Vconf -m prep SDfile
Find this compound or compounds like it in BindingDB:
Activity Spreadsheet -- Enzyme Inhibition Constant Data from BindingDB
Found 2 hits for monomerid = 50032448
TargetN-acylethanolamine-hydrolyzing acid amidase(Rattus norvegicus (Rat))
Istituto Italiano Di Tecnologia
Curated by ChEMBL
LigandPNGBDBM50032448(CHEMBL3354153)
Affinity DataIC50:  13nM. Assay description: Inhibition of NAAA in Sprague-Dawley rat lung assessed as inhibition of hydrolysis of 10-cis-heptadecenoylethanolamide by UPLC/MS method
In DepthDetails ArticlePubMed
TargetN-acylethanolamine-hydrolyzing acid amidase(Rattus norvegicus (Rat))
Istituto Italiano Di Tecnologia
Curated by ChEMBL
LigandPNGBDBM50032448(CHEMBL3354153)
Affinity DataIC50:  13nM. Assay description: Inhibition of NAAA in Sprague-Dawley rat lung assessed as inhibition of hydrolysis of 10-cis-heptadecenoylethanolamide by UPLC/MS method
In DepthDetails ArticlePubMed