BDBM50033410 CHEMBL3357669
SMILES [H][C@]12OCCC[C@]1(C)Oc1ccc(cc1[C@@]21COC(N)=N1)-c1cccc(c1)C#N
InChI Key InChIKey=BDQZBWJOZWIRHU-BVSLBCMMSA-N
Data  6 IC50
  Tab Delimited (TSV)   2D SDfile   Computed 3D by Vconf -m prep SDfile
Find this compound or compounds like it in BindingDB:
Activity Spreadsheet -- Enzyme Inhibition Constant Data from BindingDB
Found 6 hits for monomerid = 50033410
TargetBeta-secretase 1(Homo sapiens (Human))
Array Biopharma
Curated by ChEMBL
LigandPNGBDBM50033410(CHEMBL3357669)
Affinity DataIC50:  98nM. Assay description: Inhibition of purified recombinant human BACE1 expressed in CHO cells assessed as uncleaved biotinylated sAPP after 2 hrs by HTRF assay
In DepthDetails ArticlePubMed
TargetBeta-secretase 1(Homo sapiens (Human))
Array Biopharma
Curated by ChEMBL
LigandPNGBDBM50033410(CHEMBL3357669)
Affinity DataIC50:  98nM. Assay description: Inhibition of purified recombinant human BACE1 expressed in CHO cells assessed as uncleaved biotinylated sAPP after 2 hrs by HTRF assay
In DepthDetails ArticlePubMed
TargetBeta-secretase 1(Homo sapiens (Human))
Array Biopharma
Curated by ChEMBL
LigandPNGBDBM50033410(CHEMBL3357669)
Affinity DataIC50:  100nM. Assay description: Inhibition of BACE1 in HEK293 cells expressing swedish double mutant APP assessed as amyloid beta (1 to 40) peptide level after 7 hrs by HTRF assay
In DepthDetails ArticlePubMed
TargetCathepsin B(Homo sapiens (Human))
Array Biopharma
Curated by ChEMBL
LigandPNGBDBM50033410(CHEMBL3357669)
Affinity DataIC50:  8.20E+4nM. Assay description: Inhibition of cathepsin D purified from human spleen after 1 hr by FRET assay
In DepthDetails ArticlePubMed
TargetBeta-secretase 1(Homo sapiens (Human))
Array Biopharma
Curated by ChEMBL
LigandPNGBDBM50033410(CHEMBL3357669)
Affinity DataIC50:  100nM. Assay description: Inhibition of BACE1 in HEK293 cells expressing swedish double mutant APP assessed as amyloid beta (1 to 40) peptide level after 7 hrs by HTRF assay
In DepthDetails ArticlePubMed
TargetCathepsin B(Homo sapiens (Human))
Array Biopharma
Curated by ChEMBL
LigandPNGBDBM50033410(CHEMBL3357669)
Affinity DataIC50:  8.20E+4nM. Assay description: Inhibition of cathepsin D purified from human spleen after 1 hr by FRET assay
In DepthDetails ArticlePubMed