BDBM50034655 CHEMBL3360955
SMILES O=c1[nH]nc2c1cn(Cc1ccc(cc1)-n1cccn1)c1ccccc21
InChI Key InChIKey=CECWDKNNUMYQPI-UHFFFAOYSA-N
Data  1 EC50
  Tab Delimited (TSV)   2D SDfile   Computed 3D by Vconf -m prep SDfile
Find this compound or compounds like it in BindingDB:
Activity Spreadsheet -- Enzyme Inhibition Constant Data from BindingDB
Found 1 hit for monomerid = 50034655
TargetMuscarinic acetylcholine receptor M1(Homo sapiens (Human))
Vanderbilt University Medical Center
Curated by ChEMBL
LigandPNGBDBM50034655(CHEMBL3360955)
Affinity DataEC50:  1.20nM. Assay description: Positive allosteric modulator activity at human muscarinic receptor subtype 1 expressed in CHO-K1 cells by calcium mobilization assay
In DepthDetails ArticlePubMed