BDBM50035296 CHEMBL3343356
SMILES NC[C@@H]1O[C@H](OP(O)(=O)OP(O)(=O)OC[C@H]2O[C@H]([C@H](O)[C@@H]2O)n2cnc3c2nc(N)[nH]c3=O)[C@@H](O)[C@H](O)[C@@H]1O
InChI Key InChIKey=JALIVUIIJSSMML-JGQUBWHWSA-N
Data  1 KI  1 IC50
  Tab Delimited (TSV)   2D SDfile   Computed 3D by Vconf -m prep SDfile
Find this compound or compounds like it in BindingDB:
Activity Spreadsheet -- Enzyme Inhibition Constant Data from BindingDB
Found 2 hits for monomerid = 50035296
Target4-galactosyl-N-acetylglucosaminide 3-alpha-L-fucosyltransferase 9(Homo sapiens (Human))
Hamburg University
Curated by ChEMBL
LigandPNGBDBM50035296(CHEMBL3343356)
Affinity DataKi:  1.02E+5nM. Assay description: Inhibition of human recombinant alpha1,3-fucosyltransferase 9 using GDP-[14C]-fucose preincubated for 30 mins by liquid scintillation counting
In DepthDetails ArticlePubMed
Target4-galactosyl-N-acetylglucosaminide 3-alpha-L-fucosyltransferase 9(Homo sapiens (Human))
Hamburg University
Curated by ChEMBL
LigandPNGBDBM50035296(CHEMBL3343356)
Affinity DataIC50:  1.04E+5nM. Assay description: Inhibition of human recombinant alpha1,3-fucosyltransferase 9 using GDP-[14C]-fucose preincubated for 30 mins by liquid scintillation counting
In DepthDetails ArticlePubMed