BDBM50038419 CHEMBL50112::N-(1-Benzyl-piperidin-4-yl)-4-iodo-benzamide
SMILES Ic1ccc(cc1)C(=O)NC1CCN(Cc2ccccc2)CC1
InChI Key InChIKey=HELCSESNNDZLFM-UHFFFAOYSA-N
Data  3 KI
PDB links: 1 PDB ID matches this monomer.
  Tab Delimited (TSV)   2D SDfile   Computed 3D by Vconf -m prep SDfile
Find this compound or compounds like it in BindingDB:
Activity Spreadsheet -- Enzyme Inhibition Constant Data from BindingDB
Found 3 hits for monomerid = 50038419
TargetSigma non-opioid intracellular receptor 1(Homo sapiens (Human))
George Washington University Medical Center
Curated by ChEMBL
LigandPNGBDBM50038419(CHEMBL50112 | N-(1-Benzyl-piperidin-4-yl)-4-iodo-b...)
Affinity DataKi:  1.70nM. Assay description: Binding affinity against sigma-1 receptor in guinea pig brain using [3H]-(+)-pentazocine as radioligand.
TargetSigma non-opioid intracellular receptor 1(Cavia porcellus (Guinea pig))
Jiangsu Ocean University
Curated by ChEMBL
LigandPNGBDBM50038419(CHEMBL50112 | N-(1-Benzyl-piperidin-4-yl)-4-iodo-b...)
Affinity DataKi:  1.70nM. Assay description: Displacement of [3H](+)-pentazocine from sigma 1 receptor in guinea pig brain membranes by microbeta scintillation counting method
TargetD(2) dopamine receptor(Rattus norvegicus (rat))
George Washington University Medical Center
Curated by ChEMBL
LigandPNGBDBM50038419(CHEMBL50112 | N-(1-Benzyl-piperidin-4-yl)-4-iodo-b...)
Affinity DataKi:  382nM. Assay description: Binding affinity against D-2 dopamine receptor in rat brain membranes using [3H]-(-)-sulpiride as radioligand.
In DepthDetails ArticlePubMed