BDBM50042733 (9-Benzyl-3,9-diaza-bicyclo[3.3.1]non-3-yl)-(5-bromo-2,3-dimethoxy-phenyl)-methanone::CHEMBL122445
SMILES COc1cc(N)c(Cl)cc1C(=O)N1CC2CCCC(C1)N2Cc1ccccc1
InChI Key InChIKey=FHNNETCMANTKTB-UHFFFAOYSA-N
Data  1 KI
  Tab Delimited (TSV)   2D SDfile   Computed 3D by Vconf -m prep SDfile
Find this compound or compounds like it in BindingDB:
Activity Spreadsheet -- Enzyme Inhibition Constant Data from BindingDB
Found 1 hit for monomerid = 50042733
TargetD(2) dopamine receptor(Rattus norvegicus (rat))
University Of Pennsylvania
Curated by ChEMBL
LigandPNGBDBM50042733((9-Benzyl-3,9-diaza-bicyclo[3.3.1]non-3-yl)-(5-bro...)
Affinity DataKi:  0.0330nM. Assay description: Inhibition of [125I]- NCQ 298 binding to D2 receptor of rat striatal tissue
In DepthDetails ArticlePubMed