BDBM50050 1-(4-acetylphenyl)-3-[4-(diethylamino)phenyl]urea::1-[4-(diethylamino)phenyl]-3-(4-ethanoylphenyl)urea::MLS000050524::N-(4-acetylphenyl)-N'-[4-(diethylamino)phenyl]urea::SMR000076467::cid_978144
SMILES CCN(CC)c1ccc(NC(=O)Nc2ccc(cc2)C(C)=O)cc1
InChI Key InChIKey=IJAMPUSKECGEIE-UHFFFAOYSA-N
Data  2 IC50
  Tab Delimited (TSV)   2D SDfile   Computed 3D by Vconf -m prep SDfile
Find this compound or compounds like it in BindingDB:
Activity Spreadsheet -- Enzyme Inhibition Constant Data from BindingDB
Found 2 hits for monomerid = 50050
TargetNADPH oxidase 1(Homo sapiens (Human))
The Scripps Research Institute Molecular Screening Center
Curated by PubChem BioAssay
LigandPNGBDBM50050(1-(4-acetylphenyl)-3-[4-(diethylamino)phenyl]urea ...)
Affinity DataIC50:  252nM. Assay description: Data Source (MLPCN Center Name): The Scripps Research Institute Molecular Screening Center (SRIMSC) Center Affiliation: The Scripps Research Institut...
In DepthDetails PCBioAssay
TargetInduced myeloid leukemia cell differentiation protein Mcl-1(Homo sapiens (Human))
Emory University
Curated by PubChem BioAssay
LigandPNGBDBM50050(1-(4-acetylphenyl)-3-[4-(diethylamino)phenyl]urea ...)
Affinity DataIC50:  4.48E+3nM. Assay description: NIH Molecular Libraries Screening Centers Network [MLSCN] Emory Chemical Biology Discovery Center in MLSCN Assay provider: Nikolovska-Coleska, Univer...
In DepthDetails PCBioAssay