BDBM50051894 1-{4-[2-(4,5-Diphenyl-1H-imidazol-2-yl)-5-methyl-[1,3]dioxan-5-yl]-butyl}-4-(4-methoxy-phenyl)-piperazine::CHEMBL284596
SMILES COc1ccc(cc1)N1CCN(CCCCC2(C)COC(OC2)c2nc(c([nH]2)-c2ccccc2)-c2ccccc2)CC1
InChI Key InChIKey=DAPFVKWCKDXQQL-UHFFFAOYSA-N
Data  1 IC50
  Tab Delimited (TSV)   2D SDfile   Computed 3D by Vconf -m prep SDfile
Find this compound or compounds like it in BindingDB:
Activity Spreadsheet -- Enzyme Inhibition Constant Data from BindingDB
Found 1 hit for monomerid = 50051894
TargetSterol O-acyltransferase 1(Homo sapiens (Human))
RhôNe-Poulenc Rorer
Curated by ChEMBL
LigandPNGBDBM50051894(1-{4-[2-(4,5-Diphenyl-1H-imidazol-2-yl)-5-methyl-[...)
Affinity DataIC50:  10nM. Assay description: Inhibitory concentration of the compound was evaluated as concentration required to inhibit 50% of the Acyl coenzyme A:cholesterol acyltransferase 1 ...
In DepthDetails ArticlePubMed