BDBM50054347 CHEMBL3319368::US9522881, 11a-13 (L97M30)::US9844535, ID 11a-13 (L97M30)
SMILES Cn1c(c(I)c2cc(C(O)=O)c(O)cc12)-c1cccc(NC(=O)C(=O)Nc2ccc(Cl)c(c2)C(F)(F)F)c1
InChI Key InChIKey=RDDCQDAYLBIWEF-UHFFFAOYSA-N
Data  3 IC50
  Tab Delimited (TSV)   2D SDfile   Computed 3D by Vconf -m prep SDfile
Find this compound or compounds like it in BindingDB:
Activity Spreadsheet -- Enzyme Inhibition Constant Data from BindingDB
Found 3 hits for monomerid = 50054347
TargetPhosphatidylinositol 3,4,5-trisphosphate 5-phosphatase 2(Homo sapiens (Human))
Indiana University Research And Technology
US Patent
LigandPNGBDBM50054347(CHEMBL3319368 | US9522881, 11a-13 (L97M30) | US984...)
Affinity DataIC50:  1.76E+3nMpH: 7.0Assay Description:The inhibition assays were performed at 25° C. in 50 mM 3,3-dimethylglutarate buffer, pH 7.0, containing 1 mM EDTA with an ionic strength of 0.15M ad...
In DepthDetails US Patent
TargetPhosphatidylinositol 3,4,5-trisphosphate 5-phosphatase 2(Homo sapiens (Human))
Indiana University Research And Technology
US Patent
LigandPNGBDBM50054347(CHEMBL3319368 | US9522881, 11a-13 (L97M30) | US984...)
Affinity DataIC50:  1.76E+3nM. Assay description: PTP assays were conducted as previously described in Kontaridis et al., J Biol Chem. 2006; 281:6785-6792, using para-nitrophenyl phosphate (pNPP, obt...
In DepthDetails US Patent
TargetTyrosine-protein phosphatase non-receptor type 11(Homo sapiens (Human))
Indiana University School Of Medicine
Curated by ChEMBL
LigandPNGBDBM50054347(CHEMBL3319368 | US9522881, 11a-13 (L97M30) | US984...)
Affinity DataIC50:  1.76E+3nM. Assay description: Inhibition of SHP2 (unknown origin) using p-nitrophenyl phosphate substrate by microplate spectrophotometry
In DepthDetails ArticlePubMed