BDBM50054836 (4-Tridec-2-ynyloxymethyl-phenyl)-acetic acid::CHEMBL357912
SMILES CCCCCCCCCCC#CCOCc1ccc(CC(O)=O)cc1
InChI Key InChIKey=IEOJDJKIBSTJPY-UHFFFAOYSA-N
Data  1 IC50
  Tab Delimited (TSV)   2D SDfile   Computed 3D by Vconf -m prep SDfile
Find this compound or compounds like it in BindingDB:
Activity Spreadsheet -- Enzyme Inhibition Constant Data from BindingDB
Found 1 hit for monomerid = 50054836
TargetPolyunsaturated fatty acid lipoxygenase ALOX15(Sus scrofa)
Wayne State University
Curated by ChEMBL
LigandPNGBDBM50054836((4-Tridec-2-ynyloxymethyl-phenyl)-acetic acid | CH...)
Affinity DataIC50:  50nM. Assay description: Inhibitory activity against conversion of [1-14C]-arachidonic acid to 12-HPETE and its reduction product 12-HETE by porcine leukocyte type 12-lipoxyg...
In DepthDetails ArticlePubMed