BDBM50055220 1-Benzyl-2,3-dioxo-2,3-dihydro-1H-indole-5-carboxylic acid amide::1-benzyl-2,3-dioxoindoline-5-carboxamide::CHEMBL348660::acs.jmedchem.1c00409_ST.538
SMILES NC(=O)c1ccc2N(Cc3ccccc3)C(=O)C(=O)c2c1
InChI Key InChIKey=GNHGMLHHGVQGSW-UHFFFAOYSA-N
Data  2 KI  1 IC50
  Tab Delimited (TSV)   2D SDfile   Computed 3D by Vconf -m prep SDfile
Find this compound or compounds like it in BindingDB:
Activity Spreadsheet -- Enzyme Inhibition Constant Data from BindingDB
Found 3 hits for monomerid = 50055220
TargetGenome polyprotein(Human rhinovirus B)
Agouron Pharmaceuticals
Curated by ChEMBL
LigandPNGBDBM50055220(1-Benzyl-2,3-dioxo-2,3-dihydro-1H-indole-5-carboxy...)
Affinity DataKi:  19nM. Assay description: Inhibition of human rhinovirus 3C protease
In DepthDetails ArticlePubMed
TargetReplicase polyprotein 1a(Human SARS coronavirus (SARS-CoV))
Peking University
Curated by ChEMBL
LigandPNGBDBM50055220(1-Benzyl-2,3-dioxo-2,3-dihydro-1H-indole-5-carboxy...)
Affinity DataKi:  1.26E+4nM. Assay description: Inhibition of SARS CoV 3C-like protease
In DepthDetails ArticlePubMed
TargetReplicase polyprotein 1ab(Human SARS coronavirus (SARS-CoV) (Severe acute re...)
Michigan State University
LigandPNGBDBM50055220(1-Benzyl-2,3-dioxo-2,3-dihydro-1H-indole-5-carboxy...)
Affinity DataIC50:  1.25E+4nM. Assay description: This is a review article. Please point to the original journal.
In DepthDetails ArticlePubMed