BDBM50055235 CHEMBL145850::N-(2-Fluoro-benzyl)-2-(1H-indol-3-yl)-2-oxo-acetamide::cid_2990985
SMILES Fc1ccccc1CNC(=O)C(=O)c1c[nH]c2ccccc12
InChI Key InChIKey=ZMKDYQONTIIETL-UHFFFAOYSA-N
Data  1 IC50
  Tab Delimited (TSV)   2D SDfile   Computed 3D by Vconf -m prep SDfile
Find this compound or compounds like it in BindingDB:
Activity Spreadsheet -- Enzyme Inhibition Constant Data from BindingDB
Found 1 hit for monomerid = 50055235
TargetSentrin-specific protease 8(Homo sapiens (Human))
Burnham Center For Chemical Genomics
Curated by PubChem BioAssay
LigandPNGBDBM50055235(CHEMBL145850 | N-(2-Fluoro-benzyl)-2-(1H-indol-3-y...)
Affinity DataIC50: >9.90E+4nM. Assay description: Data Source: Sanford-Burnham Center for Chemical Genomics (SBCCG) Source Affiliation: Sanford-Burnham Medical Research Institute (SBMRI, San Diego, C...
In DepthDetails PCBioAssay