BDBM50056529 CHEMBL159877::[3-(3-Nitro-benzyl)-2,4-dioxo-imidazolidin-1-yl]-acetic acid
SMILES OC(=O)Cn1cc(O)n(Cc2cccc(c2)[N+]([O-])=O)c1=O
InChI Key InChIKey=KVNTYWMVIFNSIP-UHFFFAOYSA-N
Data  1 IC50
  Tab Delimited (TSV)   2D SDfile   Computed 3D by Vconf -m prep SDfile
Find this compound or compounds like it in BindingDB:
Activity Spreadsheet -- Enzyme Inhibition Constant Data from BindingDB
Found 1 hit for monomerid = 50056529
TargetAldo-keto reductase family 1 member A1(Rattus norvegicus)
Nippon Zoki Pharmaceutical
Curated by ChEMBL
LigandPNGBDBM50056529(CHEMBL159877 | [3-(3-Nitro-benzyl)-2,4-dioxo-imida...)
Affinity DataIC50: >1.00E+5nM. Assay description: In vitro inhibitory activity against rat kidney aldehyde reductase(ALR).
In DepthDetails ArticlePubMed