BDBM50056973 CHEMBL519155::NSC-255523
SMILES O[C@@H]1[C@@H](COP(O)(O)=O)O[C@H]([C@@H]1O)n1cnc2c(NCc3ccccc3)ncnc12
InChI Key InChIKey=DWVANBHPEPSMOV-LSCFUAHRSA-N
Data  2 KI
  Tab Delimited (TSV)   2D SDfile   Computed 3D by Vconf -m prep SDfile
Find this compound or compounds like it in BindingDB:
Activity Spreadsheet -- Enzyme Inhibition Constant Data from BindingDB
Found 2 hits for monomerid = 50056973
Target2'-deoxynucleoside 5'-phosphate N-hydrolase 1(Rattus norvegicus (Rat))
University Of Paris
Curated by ChEMBL
LigandPNGBDBM50056973(CHEMBL519155 | NSC-255523)
Affinity DataKi:  1.80E+3nM. Assay description: Inhibition of rat DNPH1 assessed as 2-deoxyribose 5-phosphate production by spectrophotometrically
In DepthDetails ArticlePubMed
Target2'-deoxynucleoside 5'-phosphate N-hydrolase 1(Homo sapiens (Human))
University Of Paris
Curated by ChEMBL
LigandPNGBDBM50056973(CHEMBL519155 | NSC-255523)
Affinity DataKi:  1.90E+3nM. Assay description: Inhibition of human DNPH1 assessed as 2-deoxyribose 5-phosphate production by spectrophotometrically
In DepthDetails ArticlePubMed