BDBM50058513 CHEMBL3326654
SMILES N(c1cccnc1)c1ncnn2cccc12
InChI Key InChIKey=KTWGHBNFKBORPM-UHFFFAOYSA-N
Data  1 Kd
PDB links: 1 PDB ID matches this monomer.
  Tab Delimited (TSV)   2D SDfile   Computed 3D by Vconf -m prep SDfile
Find this compound or compounds like it in BindingDB:
Activity Spreadsheet -- Enzyme Inhibition Constant Data from BindingDB
Found 1 hit for monomerid = 50058513
TargetMitogen-activated protein kinase kinase kinase kinase 4(Homo sapiens (Human))
Genentech
Curated by ChEMBL
LigandPNGBDBM50058513(CHEMBL3326654)
Affinity DataKd:  4.80E+4nM. Assay description: Binding affinity to MAP4K4 (unknown origin) by surface plasmon resonance assay